داده‌های دایره‌ای
scope note: داده‌هایی چرخه‌ای که جهت‌ها مقادیر آنها به‌ شمار می‌آیند.
broader: داده‌های چرخه‌ای
preferred label: circular data @en
type: Concept

داده‌های چرخه‌ای
preferred label: cyclic data @en
type: Concept
narrower: داده‌های دایره‌ای