داده
preferred label: data @en
type: Concept
narrower: سرچشمه داده‌ها

سرچشمه داده‌ها
scope note: آنچه داده‌ها از آن برگرفته شده باشد، اعم از شی‌ء فیزیکی یا حالت آن یا فرایند یا کمیت یا دستگاهی که تولیدکنندۀ اطلاعات داده‌ای باشد.
broader: داده
preferred label: data source @en
type: Concept