داده
preferred label: data @en
type: Concept
narrower: داده‌های آزمایشی

داده‌های آزمایشی
alternative label: داده‌های نمونه
scope note: مجموعه‌ای از داده‌ها برای آزمایش نرم‌افزار
broader: داده
preferred label: test data @en
type: Concept