داده‌برداری جزئی
scope note: نوعی داده‌برداری، ازطریق نمونه‌برداری احتمالاتی یا غیراحتمالاتی، که در آن فقط بخشی از واحد نمونه در یک جامعۀ آماری بررسی می‌شود.
broader: داده‌برداری
preferred label: sample data acquisition @en
type: Concept

داده‌برداری
preferred label: data acquisition @en
type: Concept
narrower: داده‌برداری جزئی