داده‌پردازی
preferred label: data processing @en
type: Concept
narrower: برگردانی داده‌ها

برگردانی داده‌ها
scope note: تغییر رمزبندی داده‌ها از صورتی به صورت دیگر
broader: داده‌پردازی
preferred label: data conversion @en
type: Concept