رتبه‌بندی داده‌ها
scope note: مشخص کردن رتبۀ یک‌یک داده‌ها براساس اهمیت نسبی آنها در یک زیرمجموعۀ معین
broader: داده‌پردازی
preferred label: data ranking @en
type: Concept

داده‌پردازی
preferred label: data processing @en
type: Concept
narrower: رتبه‌بندی داده‌ها