داده‌پردازی
preferred label: data processing @en
type: Concept
narrower: بخش‌بندی داده‌ها

بخش‌بندی داده‌ها
scope note: تقسیم مجموعه‌ای از داده‌ها به چند زیرمجموعه برای اِعمال فرایندهای خاص روی آنها
broader: داده‌پردازی
preferred label: data sectioning @en
type: Concept