دادگان منتشرشده
alternative label: پایگاه‌داده منتشرشده
scope note: دادگانی که اطلاعات به‌دست‌آمده از آن با استفاده از نشر رومیزی یا فنّاوری اینترنت و با هدف تولید گزارش در اختیار عموم قرار گرفته باشد.
related: نشر دادگان
broader: دادگان
preferred label: published database @en
type: Concept

نشر دادگان
preferred label: database publishing @en
type: Concept
related: دادگان منتشرشده

دادگان
preferred label: database @en
type: Concept
narrower: دادگان منتشرشده