ترکسار
scope note: ترک‌های ریز بر سطح قطعۀ لاستیک، مانند تایر، که براثر اکسایش یا پیرش پدید می‌آید.
related: لاستیک
broader: ترک
preferred label: checking @en
type: Concept

لاستیک
preferred label: rubber @en
type: Concept
related: ترکسار

ترک
preferred label: crack @en
type: Concept
narrower: ترکسار