ترک انعکاسی
scope note: تَرَکی در سطح خارجی راه به دلیل حرکتِ درزها یا پدید آمدن تَرَک‌هایی در زیراساس یا سطح روسازی
broader: ترک
preferred label: reflection crack @en
type: Concept

ترک
preferred label: crack @en
type: Concept
narrower: ترک انعکاسی