ترک زیرمهره‌ای
alternative label: ترک تأخیری
scope note: نوعی ترک سرد زیرسطحی که براثر ورود هیدروژن اتمی در دمای بالا در منطقۀ گرمادیده به وجود می‌آید.
broader: ترک
preferred label: underbead crack @en
type: Concept

ترک
preferred label: crack @en
type: Concept
narrower: ترک زیرمهره‌ای