نشت (مایع)
preferred label: leakage (fluid) @en
type: Concept
narrower: شارش نشتی

شارش نشتی
scope note: جریانی از ماده که از لقی بین پرۀ ماردان (screw) و استوانک می‌گذرد.
broader: نشت (مایع)
preferred label: leakage flow @en
type: Concept