آب‌کاری
preferred label: electroplating @en
type: Concept
narrower: آب‌کاری گزینشی

آب‌کاری گزینشی
scope note: نوعی آب‌کاری که در آن بعضی از قسمت‌های قطعه که نباید آب‌کاری شود با ماده‌ای نارسانا پوشانده می‌شود تا از جریان الکتریکی و درنتیجه آب‌کاری در آن قسمت‌ها جلوگیری شود.
broader: آب‌کاری
preferred label: selective plating @en
type: Concept