فن پوشانش
preferred label: coating technique @en
type: Concept
narrower: پوشانش غلتکی

پوشانش غلتکی
scope note: فرایندی که در آن، مادۀ پوششی به‌صورت مکانیکی بر ورق فلزی میان دو غلتک قرار می‌گیرد؛ یکی از این غلتک‌ها با فیلمی (film) از مادۀ پوششی مایع پوشانده می‌شود.
broader: فن پوشانش
preferred label: roller coating @en
type: Concept