طراحی
preferred label: design @en
type: Concept
narrower: طراحی هندسی

طراحی هندسی
scope note: روشی در طراحی راه با توجه به عوارض طبیعی و با رعایت معیارهای طراحی و ایمنی و عملکرد
broader: طراحی
preferred label: geometric design @en
type: Concept