طراحی اطلاعات
scope note: صورت‌بندی و ارائۀ اطلاعات به‌گونه‌ای‌که به بهترین شکل نیازهای کاربران را پاسخ گوید.
broader: طراحی
preferred label: information design @en
type: Concept

طراحی
preferred label: design @en
type: Concept
narrower: طراحی اطلاعات