طراحی
preferred label: design @en
type: Concept
narrower: طراحی شبکه

طراحی شبکه
scope note: فرایند تعیین کمیت‌ها و معماری مدار و تجهیزات برای رسیدن به توازن در هزینه و خدمات
broader: طراحی
preferred label: network design @en
type: Concept