تردش هیدریدی
scope note: نوعی تُردش هیدروژنی در فلزهای خاص که مشخصۀ آنها تشکیل فاز هیدرید با جذب مقدار زیادی هیدروژن است.
broader: تردش
preferred label: hydride embrittlement @en
type: Concept

تردش
preferred label: embrittlement @en
type: Concept
narrower: تردش هیدریدی