تردش روی‌اندودی
preferred label: zinc embrittlement @en
type: Concept
broader: تردش فلزمذابی

تردش
preferred label: embrittlement @en
type: Concept
narrower: تردش فلزمذابی

تردش فلزمذابی
scope note: نوعی ترک‌خوردگی محیطی در فلزات معمولاً چکش‌خوار براثر تماس با فلز مذاب و متعاقب آن ایجاد تنش کششی
narrower: تردش روی‌اندودی
broader: تردش
preferred label: liquid-metal embrittlement @en
type: Concept