نقش پراش
scope note: نقشی که امواج پراشیده بر روی پرده ایجاد می‌کنند.
broader: پراش
preferred label: diffraction pattern @en
type: Concept

پراش
preferred label: diffraction @en
type: Concept
narrower: نقش پراش