پخش مبادله‌ای
scope note: فرایندی که در آن پخش مولکول‌ها از خلال غشا در دو جهت مخالف به تعادل می‌رسد.
related: غشا
broader: پخش
preferred label: exchange diffusion @en
type: Concept

غشا
preferred label: membrane @en
type: Concept
related: پخش مبادله‌ای

پخش
preferred label: diffusion @en
type: Concept
narrower: پخش مبادله‌ای