بیماری
preferred label: disease @en
type: Concept
narrower: بیماری عفونی

بیماری عفونی
scope note: هرنوع بیماری واگیردار که ازطریق تماس مستقیم یا غیرمستقیم از فردی به فرد دیگر یا از حیوان به انسان منتقل می‌شود.
broader: بیماری
preferred label: infectious disease @en
type: Concept