پاشش (موج)
preferred label: dispersion (wave) @en
type: Concept
narrower: پاشش تپ

پاشش تپ
alternative label: پاشش پالس
scope note: افزایش پهنای تَپ/ پالس براثر عبور از خط انتقال
broader: پاشش (موج)
preferred label: pulse dispersion @en
type: Concept