اعوجاج (موج)
preferred label: distortion (wave) @en
type: Concept
narrower: اعوجاج دامنه

اعوجاج دامنه
scope note: هر تغییر در تراز بسامدهای درون باند گذر مجرای ارتباطی
broader: اعوجاج (موج)
preferred label: amplitude distortion @en
type: Concept