اعوجاج پهنای تپ
alternative label: اعوجاج پهنای پالس
scope note: تفاوت پهنای تَپ/ پالس در دو نقطۀ مختلف خط انتقال براثر تغییر شکل تَپ/ پالس
broader: اعوجاج (موج)
preferred label: pulse duration distortion @en
type: Concept

اعوجاج (موج)
preferred label: distortion (wave) @en
type: Concept
narrower: اعوجاج پهنای تپ