خشکسالی
preferred label: drought @en
type: Concept
narrower: خشکسالی کشاورزی

خشکسالی کشاورزی
scope note: شرایط جوّی نامناسب یا محدودیت رطوبت خاک که به پاسخ‌های نامطلوب محصول منجر می‌شود.
broader: خشکسالی
preferred label: agricultural drought @en
type: Concept