وردسپهر
scope note: قسمت پایینی جوّ، از سطح زمین تا ارتفاع حدود 10 تا 20 کیلومتر، که در آن دما با افزایش ارتفاع تقریباً به‌صورت یکنواخت کاهش می‌یابد و تغییر وضع هوا در آن صورت می‌گیرد.
related: هواشناسی فیزیکی
broader: جو زمین
preferred label: troposphere @en
type: Concept

هواشناسی فیزیکی
preferred label: physical meteorology @en
type: Concept
related: وردسپهر

جو زمین
preferred label: earth atmosphere @en
type: Concept
narrower: وردسپهر