زمین‌لرزه
preferred label: earthquake @en
type: Concept
narrower: بزرگی زمین‌لرزه

بزرگی زمین‌لرزه
scope note: میزان قدرت زمین‌لرزه یا انرژی کُرنشی آزادشده با آن، بر پایۀ مشاهدات لرزه‌نگاشتی
broader: زمین‌لرزه
preferred label: earthquake magnitude @en
type: Concept