زمین‌لرزه
preferred label: earthquake @en
type: Concept
narrower: زمین‌لرزه القایی

زمین‌لرزه القایی
scope note: زمین‌لرزه‌ای که از فعالیت‌های انسان، مانند تزریق مایعات در اعماق زمین، ساخت سد و انجام انفجارهای هسته‌ای زیرزمینی ناشی شود.
broader: زمین‌لرزه
preferred label: induced earthquake @en
type: Concept