بوم‌شناسی اطلاعات
preferred label: information ecology @en
type: Concept
narrower: کلان‌بوم‌شناسی اطلاعات

کلان‌بوم‌شناسی اطلاعات
scope note: مطالعۀ روابط متقابل مردم و سازمان‌ها و فنّاوری‌ها با محیط‌های اطلاعاتی در مقیاس منطقه‌ای یا بین‌المللی
broader: بوم‌شناسی اطلاعات
preferred label: macro-ecology of information @en
type: Concept