بوم‌شناسی
preferred label: ecology @en
type: Concept
narrower: بوم‌شناسی دریا

بوم‌شناسی دریا
scope note: مطالعۀ‌ برهم‌کنش اندامگان‌هایی که در دریا زندگی می‌کنند و محیط‌زیست آنها
broader: بوم‌شناسی
preferred label: marine ecology @en
type: Concept