بوم‌شناسی گیاهی
preferred label: plant ecology @en
type: Concept
narrower: بوم‌شناسی گیاه زراعی

بوم‌شناسی گیاه زراعی
scope note: علمی که دربارۀ برهم‌کنش گیاه زراعی و محیط بحث می‌کند.
broader: بوم‌شناسی گیاهی
preferred label: crop ecology @en
type: Concept