چفته صلب
scope note: چَفته‌ای یکپارچه که اتصال آن به پایه، از نوع اتصال صُلب است.
broader: چفته
preferred label: rigid arch @en
type: Concept

چفته
preferred label: arch (structural) @en
type: Concept
narrower: چفته صلب