بازده ظرفیت حمل
scope note: نسبت ظرفیت حمل درنظرگرفته‌شده در طراحی کشتی به مقدار باری که جابه‌جا می‌شود.
related: کشتی
broader: بازده
preferred label: deadweight efficiency @en
type: Concept

کشتی
preferred label: ship @en
type: Concept
related: بازده ظرفیت حمل

بازده
preferred label: efficiency @en
type: Concept
narrower: بازده ظرفیت حمل