پست برق
preferred label: electric substation @en
type: Concept
narrower: پست باجه‌ای

پست باجه‌ای
scope note: پست برق کوچک و اغلب پیش‌ساخته‌ای که معمولاً فقط برای توزیع از آن استفاده می‌شود.
broader: پست برق
preferred label: kiosk substation @en
type: Concept