پست باکارور
preferred label: manned substation @en
type: Concept
narrower: پست باکارور دائمی

پست باکارور دائمی
scope note: پست برقی که دائماً به‌وسیلۀ کارکنانی که در آن حضور دارند واپایش می‌شود.
broader: پست باکارور
preferred label: permanently manned substation @en
type: Concept