چفته دومفصلی
scope note: چَفته‌ای که اتصال آن به پاکار در دو سرِ چَفته از نوع اتصال مفصلی (hinged joint) است.
broader: چفته
preferred label: two-hinged arch @en
type: Concept

چفته
preferred label: arch (structural) @en
type: Concept
narrower: چفته دومفصلی