پست برق
preferred label: electric substation @en
type: Concept
narrower: پست کششی

سامانه کششی
preferred label: traction system @en
type: Concept
related: پست کششی

پست کششی
scope note: پست برقی که وظیفۀ اصلی آن تأمین انرژی سامانۀ کششی (traction system) است.
related: سامانه کششی
broader: پست برق
preferred label: traction substation @en
type: Concept