پست کاهنده ولتاژ
scope note: ست مبدل ولتاژی که ولتاژ خروجی آن پایین‌تر از ولتاژ ورودی آن است.
broader: پست مبدل ولتاژ
preferred label: step-down substation @en
type: Concept

پست مبدل ولتاژ
preferred label: transformer substation @en
type: Concept
narrower: پست کاهنده ولتاژ