الکترون
preferred label: electron @en
type: Concept
narrower: الکترون‌های درونی

الکترون‌های درونی
scope note: الکترون‌هایی که تمام ترازهای انرژی یک اتم، غیر از تراز ظرفیت را پر می‌کنند.
broader: الکترون
preferred label: core electrons @en
type: Concept