الکترون‌های نامستقر
scope note: الکترون‌هایی که متعلق به هیچ اتم مستقلی نیستند و در تمام مولکول در نزدیکی اتم‌های مختلف پراکنده‌اند.
broader: الکترون
preferred label: delocalized electrons @en
type: Concept

الکترون
preferred label: electron @en
type: Concept
narrower: الکترون‌های نامستقر