نوترون
preferred label: neutron @en
type: Concept
narrower: نوترون آنی

نوترون آنی
scope note: نوترونی که در فرایند شکافت هسته‌ای بدون تأخیر آزاد می‌شود.
broader: نوترون
preferred label: prompt neutron @en
type: Concept