مهندسی زیست‌مواد
preferred label: biomaterial engineering @en
type: Concept
related: زیست‌مهندسی

زیست‌مهندسی
scope note: کاربرد روش‌های مهندسی برای دستیابی به بیوسنتز (biosynthesis) فراورده‌های جانوری و گیاهی مانند فرایند تخمیر
related: مهندسی زیست‌مواد
broader: مهندسی
preferred label: bioengineering @en
type: Concept

مهندسی
preferred label: engineering @en
type: Concept
narrower: زیست‌مهندسی