مهندسی پزشکی
preferred label: medical engineering @en
type: Concept
narrower: مهندسی بالینی

مهندسی بالینی
alternative label: مهندسی بیمارستان
scope note: فراهم کردن بستر فنّاورانۀ لازم برای تأمین ایمنی الکتریکی تمامی تجهیزات بیمارستانی که در پیرامون بیمار قرار دارند یا به بدن او متصل می‌شوند.
related: بیمارستان
broader: مهندسی پزشکی
preferred label: clinical engineering @en
type: Concept

بیمارستان
preferred label: hospital @en
type: Concept
related: مهندسی بالینی