مهندسی توان‌بخشی
scope note: کاربرد سامانمند فنّاوری و روش‌های مهندسی و اصول علمی در بررسی و حل مشکلات افراد ناتوان یا کم‌توان در حوزه‌های آموزشی و شغلی و حمل‌ونقل و زندگی مستقل و دیگر فعالیت‌ها
related: تجهیزات توانبخشی انسانی
broader: مهندسی پزشکی
preferred label: rehabilitation engineering @en
type: Concept

تجهیزات توانبخشی انسانی
preferred label: human rehabilitation equipment @en
type: Concept
related: مهندسی توان‌بخشی

مهندسی پزشکی
preferred label: medical engineering @en
type: Concept
narrower: مهندسی توان‌بخشی