اتم
preferred label: atom @en
type: Concept
narrower: اتم فراسرد

اتم فراسرد
scope note: هریک از اتم‌های یک مجموعه‌اتم که دمای ترمودینامیکی آن کمتر از یک میلی‌کلوین است.
broader: اتم
preferred label: ultra-cold atom @en
type: Concept