شنوایی‌سنج تک‌بسامدی
scope note: نوعی شنوایی‌سنج که در آن از صوت‌های خالص یا تک‌بسامدها به‌عنوان محرک شنیداری استفاده می‌شود.
broader: دستگاه شنوایی‌سنج
preferred label: pure-tone audiometer @en
type: Concept

دستگاه شنوایی‌سنج
preferred label: audiometer @en
type: Concept
narrower: شنوایی‌سنج تک‌بسامدی