زی‌حسگر
preferred label: biosensor @en
type: Concept
narrower: زی‌حسگر نوری

زی‌حسگر نوری
alternative label: زی‌حسگر اپتیکی
scope note: زی‌حسگری که بر پایۀ تغییرات خواص نوری واسط (medium) زیستی یا فیزیکی کار می‌کند.
broader: زی‌حسگر
preferred label: optical biosensor @en
type: Concept