چرخک
alternative label: ویلچر
scope note: صندلی چرخ‌داری که از آن برای کمک به حرکت و جابه‌جایی بیماران و معلولان استفاده شود.
related: مهندسی توانبخشی انسانی
broader: تجهیزات توانبخشی انسانی
preferred label: wheelchair @en
type: Concept

مهندسی توانبخشی انسانی
preferred label: human rehabilitation engineering @en
type: Concept
related: چرخک

تجهیزات توانبخشی انسانی
preferred label: human rehabilitation equipment @en
type: Concept
narrower: چرخک