دستگیره تبدیل ترمز
scope note: دستگیره‌ای برای تغییر وضعیت سامانۀ ترمز قطار در دو طرف واگن
broader: ترمز
preferred label: brake change-over device @en
type: Concept

ترمز
preferred label: brake @en
type: Concept
narrower: دستگیره تبدیل ترمز